CRAN Package Check Results for Package getCRUCLdata

Last updated on 2019-01-22 00:46:26 CET.

Flavor Version Tinstall Tcheck Ttotal Status Flags
r-devel-linux-x86_64-debian-clang 0.2.5 1.75 53.59 55.34 OK
r-devel-linux-x86_64-debian-gcc 0.2.5 1.40 41.66 43.06 OK
r-devel-linux-x86_64-fedora-clang 0.2.5 65.38 OK
r-devel-linux-x86_64-fedora-gcc 0.2.5 63.04 OK
r-devel-windows-ix86+x86_64 0.2.5 5.00 87.00 92.00 OK
r-patched-linux-x86_64 0.2.5 1.69 58.33 60.02 ERROR
r-patched-solaris-x86 0.2.5 168.90 ERROR
r-release-linux-x86_64 0.2.5 1.75 59.73 61.48 ERROR
r-release-windows-ix86+x86_64 0.2.5 5.00 92.00 97.00 OK
r-release-osx-x86_64 0.2.5 OK
r-oldrel-windows-ix86+x86_64 0.2.5 5.00 74.00 79.00 OK
r-oldrel-osx-x86_64 0.2.5 OK

Check Details

Version: 0.2.5
Check: tests
Result: ERROR
     Running ‘testthat.R’ [33s/35s]
    Running the tests in ‘tests/testthat.R’ failed.
    Complete output:
     > library(testthat)
     > library(getCRUCLdata)
     >
     > test_check("getCRUCLdata")
     ── 1. Failure: Test that create_stack creates tmx if requested (@test-create_CRU
     raster::maxValue(CRU_stack_list[[1]][[1]]) not equal to 12.9.
     1/1 mismatches
     [1] 12.9 - 12.9 == 5.72e-07
    
     ── 2. Failure: Test that create_stack creates tmn if requested (@test-create_CRU
     raster::maxValue(CRU_stack_list[[1]][[1]]) not equal to 4.3.
     1/1 mismatches
     [1] 4.3 - 4.3 == 1.91e-07
    
     ══ testthat results ═══════════════════════════════════════════════════════════
     OK: 469 SKIPPED: 23 FAILED: 2
     1. Failure: Test that create_stack creates tmx if requested (@test-create_CRU_stack.R#868)
     2. Failure: Test that create_stack creates tmn if requested (@test-create_CRU_stack.R#1233)
    
     Error: testthat unit tests failed
     Execution halted
Flavor: r-patched-linux-x86_64

Version: 0.2.5
Check: tests
Result: ERROR
     Running ‘testthat.R’ [118s/130s]
    Running the tests in ‘tests/testthat.R’ failed.
    Complete output:
     > library(testthat)
     > library(getCRUCLdata)
     >
     > test_check("getCRUCLdata")
     ── 1. Failure: Test that create_stack creates tmx if requested (@test-create_CRU
     raster::maxValue(CRU_stack_list[[1]][[1]]) not equal to 12.9.
     1/1 mismatches
     [1] 12.9 - 12.9 == 5.72e-07
    
     ── 2. Failure: Test that create_stack creates tmn if requested (@test-create_CRU
     raster::maxValue(CRU_stack_list[[1]][[1]]) not equal to 4.3.
     1/1 mismatches
     [1] 4.3 - 4.3 == 1.91e-07
    
     ══ testthat results ═══════════════════════════════════════════════════════════
     OK: 613 SKIPPED: 23 FAILED: 2
     1. Failure: Test that create_stack creates tmx if requested (@test-create_CRU_stack.R#868)
     2. Failure: Test that create_stack creates tmn if requested (@test-create_CRU_stack.R#1233)
    
     Error: testthat unit tests failed
     Execution halted
Flavor: r-patched-solaris-x86

Version: 0.2.5
Check: tests
Result: ERROR
     Running ‘testthat.R’ [34s/38s]
    Running the tests in ‘tests/testthat.R’ failed.
    Complete output:
     > library(testthat)
     > library(getCRUCLdata)
     >
     > test_check("getCRUCLdata")
     ── 1. Failure: Test that create_stack creates tmn if requested (@test-create_CRU
     raster::maxValue(CRU_stack_list[[1]][[1]]) not equal to 4.3.
     1/1 mismatches
     [1] 4.3 - 4.3 == 3.81e-07
    
     ══ testthat results ═══════════════════════════════════════════════════════════
     OK: 398 SKIPPED: 23 FAILED: 1
     1. Failure: Test that create_stack creates tmn if requested (@test-create_CRU_stack.R#1233)
    
     Error: testthat unit tests failed
     Execution halted
Flavor: r-release-linux-x86_64