CRAN Package Check Results for Package princurve

Last updated on 2018-07-18 01:49:36 CEST.

Flavor Version Tinstall Tcheck Ttotal Status Flags
r-devel-linux-x86_64-debian-clang 2.1.0 13.51 74.56 88.07 ERROR
r-devel-linux-x86_64-debian-gcc 2.1.0 9.85 54.37 64.22 ERROR
r-devel-linux-x86_64-fedora-clang 2.1.0 106.25 ERROR
r-devel-linux-x86_64-fedora-gcc 2.1.0 104.60 OK
r-devel-windows-ix86+x86_64 2.1.0 40.00 212.00 252.00 OK
r-patched-linux-x86_64 2.1.0 15.83 69.86 85.69 OK
r-patched-solaris-x86 2.1.0 129.90 ERROR
r-release-linux-x86_64 2.1.0 15.98 69.61 85.59 OK
r-release-windows-ix86+x86_64 2.1.0 35.00 194.00 229.00 OK
r-release-osx-x86_64 2.1.0 ERROR
r-oldrel-windows-ix86+x86_64 2.1.0 46.00 168.00 214.00 OK
r-oldrel-osx-x86_64 2.1.0 OK

Additional issues

rchk

Check Details

Version: 2.1.0
Check: tests
Result: ERROR
     Running ‘testthat.R’ [48s/67s]
    Running the tests in ‘tests/testthat.R’ failed.
    Complete output:
     > library(testthat)
     >
     > Sys.setenv("R_TESTS" = "")
     >
     > test_check("princurve")
     Loading required package: princurve
     * installing *source* package ‘princurvelegacy’ ...
     ** libs
     make[1]: Entering directory '/tmp/RtmpA4ntil/devtools31b3b34119b/dynverse-princurve-81b12ac/src'
     gfortran -fpic -g -O2 -Wall -pedantic -mtune=native -c getlam.f -o getlam.o
     getlam.f:33:5:
    
     23013 continue
     1
     Warning: Label 23013 at (1) defined but not used [-Wunused-label]
     getlam.f:27:5:
    
     23011 continue
     1
     Warning: Label 23011 at (1) defined but not used [-Wunused-label]
     getlam.f:22:5:
    
     23009 continue
     1
     Warning: Label 23009 at (1) defined but not used [-Wunused-label]
     getlam.f:29:5:
    
     23007 continue
     1
     Warning: Label 23007 at (1) defined but not used [-Wunused-label]
     getlam.f:17:5:
    
     23005 continue
     1
     Warning: Label 23005 at (1) defined but not used [-Wunused-label]
     getlam.f:113:5:
    
     23037 continue
     1
     Warning: Label 23037 at (1) defined but not used [-Wunused-label]
     getlam.f:82:5:
    
     23027 continue
     1
     Warning: Label 23027 at (1) defined but not used [-Wunused-label]
     getlam.f:73:5:
    
     23023 continue
     1
     Warning: Label 23023 at (1) defined but not used [-Wunused-label]
     getlam.f:101:5:
    
     23020 ik=ik+1
     1
     Warning: Label 23020 at (1) defined but not used [-Wunused-label]
     getlam.f:92:10:
    
     lam=ik+(d1)
     1
     Warning: Possible change of value in conversion from REAL(8) to REAL(4) at (1) [-Wconversion]
     getlam.f:104:11:
    
     left=lammin
     1
     Warning: Possible change of value in conversion from REAL(4) to INTEGER(4) at (1) [-Wconversion]
     getlam.f:48:5:
    
     23018 continue
     1
     Warning: Label 23018 at (1) defined but not used [-Wunused-label]
     getlam.f:50:5:
    
     23015 i=i+1
     1
     Warning: Label 23015 at (1) defined but not used [-Wunused-label]
     gfortran -fpic -g -O2 -Wall -pedantic -mtune=native -c sortdi.f -o sortdi.o
     clang-6.0 -shared -L/home/hornik/tmp/R.check/r-devel-clang/Work/build/lib -Wl,-O1 -o princurvelegacy.so getlam.o sortdi.o -L/usr/lib/gcc/x86_64-linux-gnu/7 -lgfortran -lm -lquadmath -L/home/hornik/tmp/R.check/r-devel-clang/Work/build/lib -lR
     make[1]: Leaving directory '/tmp/RtmpA4ntil/devtools31b3b34119b/dynverse-princurve-81b12ac/src'
     make[1]: Entering directory '/tmp/RtmpA4ntil/devtools31b3b34119b/dynverse-princurve-81b12ac/src'
     make[1]: Leaving directory '/tmp/RtmpA4ntil/devtools31b3b34119b/dynverse-princurve-81b12ac/src'
     installing to /tmp/RtmpDO3H5c/RLIBS_72418159e31/princurvelegacy/libs
     ** R
     ** byte-compile and prepare package for lazy loading
     ** help
     *** installing help indices
     ** building package indices
     ** testing if installed package can be loaded
     * DONE (princurvelegacy)
     ── 1. Failure: project_to_cells is at least as fast as legacy get.lam (@test-leg
     smic$median[[2]] is not less than smic$median[[1]] * 2. Difference: 4.53
    
     ══ testthat results ═══════════════════════════════════════════════════════════
     OK: 536 SKIPPED: 0 FAILED: 1
     1. Failure: project_to_cells is at least as fast as legacy get.lam (@test-legacy_princurve.R#69)
    
     Error: testthat unit tests failed
     Execution halted
Flavor: r-devel-linux-x86_64-debian-clang

Version: 2.1.0
Check: tests
Result: ERROR
     Running ‘testthat.R’ [33s/54s]
    Running the tests in ‘tests/testthat.R’ failed.
    Complete output:
     > library(testthat)
     >
     > Sys.setenv("R_TESTS" = "")
     >
     > test_check("princurve")
     Loading required package: princurve
     * installing *source* package ‘princurvelegacy’ ...
     ** libs
     make[1]: Entering directory '/home/hornik/tmp/scratch/RtmpzqLmLg/devtools257318457d0e/dynverse-princurve-81b12ac/src'
     gfortran-7 -fpic -g -O2 -Wall -pedantic -mtune=native -c getlam.f -o getlam.o
     getlam.f:33:5:
    
     23013 continue
     1
     Warning: Label 23013 at (1) defined but not used [-Wunused-label]
     getlam.f:27:5:
    
     23011 continue
     1
     Warning: Label 23011 at (1) defined but not used [-Wunused-label]
     getlam.f:22:5:
    
     23009 continue
     1
     Warning: Label 23009 at (1) defined but not used [-Wunused-label]
     getlam.f:29:5:
    
     23007 continue
     1
     Warning: Label 23007 at (1) defined but not used [-Wunused-label]
     getlam.f:17:5:
    
     23005 continue
     1
     Warning: Label 23005 at (1) defined but not used [-Wunused-label]
     getlam.f:113:5:
    
     23037 continue
     1
     Warning: Label 23037 at (1) defined but not used [-Wunused-label]
     getlam.f:82:5:
    
     23027 continue
     1
     Warning: Label 23027 at (1) defined but not used [-Wunused-label]
     getlam.f:73:5:
    
     23023 continue
     1
     Warning: Label 23023 at (1) defined but not used [-Wunused-label]
     getlam.f:101:5:
    
     23020 ik=ik+1
     1
     Warning: Label 23020 at (1) defined but not used [-Wunused-label]
     getlam.f:92:10:
    
     lam=ik+(d1)
     1
     Warning: Possible change of value in conversion from REAL(8) to REAL(4) at (1) [-Wconversion]
     getlam.f:104:11:
    
     left=lammin
     1
     Warning: Possible change of value in conversion from REAL(4) to INTEGER(4) at (1) [-Wconversion]
     getlam.f:48:5:
    
     23018 continue
     1
     Warning: Label 23018 at (1) defined but not used [-Wunused-label]
     getlam.f:50:5:
    
     23015 i=i+1
     1
     Warning: Label 23015 at (1) defined but not used [-Wunused-label]
     gfortran-7 -fpic -g -O2 -Wall -pedantic -mtune=native -c sortdi.f -o sortdi.o
     gcc-7 -shared -L/home/hornik/tmp/R.check/r-devel-gcc/Work/build/lib -Wl,-O1 -o princurvelegacy.so getlam.o sortdi.o -lgfortran -lm -lquadmath -L/home/hornik/tmp/R.check/r-devel-gcc/Work/build/lib -lR
     make[1]: Leaving directory '/home/hornik/tmp/scratch/RtmpzqLmLg/devtools257318457d0e/dynverse-princurve-81b12ac/src'
     make[1]: Entering directory '/home/hornik/tmp/scratch/RtmpzqLmLg/devtools257318457d0e/dynverse-princurve-81b12ac/src'
     make[1]: Leaving directory '/home/hornik/tmp/scratch/RtmpzqLmLg/devtools257318457d0e/dynverse-princurve-81b12ac/src'
     installing to /home/hornik/tmp/scratch/Rtmp39iTlX/RLIBS_54ac3322ab70/princurvelegacy/libs
     ** R
     ** byte-compile and prepare package for lazy loading
     ** help
     *** installing help indices
     ** building package indices
     ** testing if installed package can be loaded
     * DONE (princurvelegacy)
     ── 1. Failure: project_to_cells is at least as fast as legacy get.lam (@test-leg
     smic$median[[2]] is not less than smic$median[[1]] * 2. Difference: 1.59
    
     ══ testthat results ═══════════════════════════════════════════════════════════
     OK: 536 SKIPPED: 0 FAILED: 1
     1. Failure: project_to_cells is at least as fast as legacy get.lam (@test-legacy_princurve.R#69)
    
     Error: testthat unit tests failed
     Execution halted
Flavor: r-devel-linux-x86_64-debian-gcc

Version: 2.1.0
Check: tests
Result: ERROR
     Running ‘testthat.R’ [53s/59s]
    Running the tests in ‘tests/testthat.R’ failed.
    Complete output:
     > library(testthat)
     >
     > Sys.setenv("R_TESTS" = "")
     >
     > test_check("princurve")
     Loading required package: princurve
     * installing *source* package ‘princurvelegacy’ ...
     ** libs
     make[1]: Entering directory '/tmp/RtmpSfEH7Q/devtoolsae9e63d1a6ae/dynverse-princurve-81b12ac/src'
     gfortran -fpic -g -O2 -mtune=native -Wall -pedantic -c getlam.f -o getlam.o
     gfortran -fpic -g -O2 -mtune=native -Wall -pedantic -c sortdi.f -o sortdi.o
     getlam.f:33:5:
    
     23013 continue
     1
     Warning: Label 23013 at (1) defined but not used [-Wunused-label]
     getlam.f:27:5:
    
     23011 continue
     1
     Warning: Label 23011 at (1) defined but not used [-Wunused-label]
     getlam.f:22:5:
    
     23009 continue
     1
     Warning: Label 23009 at (1) defined but not used [-Wunused-label]
     getlam.f:29:5:
    
     23007 continue
     1
     Warning: Label 23007 at (1) defined but not used [-Wunused-label]
     getlam.f:17:5:
    
     23005 continue
     1
     Warning: Label 23005 at (1) defined but not used [-Wunused-label]
     getlam.f:113:5:
    
     23037 continue
     1
     Warning: Label 23037 at (1) defined but not used [-Wunused-label]
     getlam.f:82:5:
    
     23027 continue
     1
     Warning: Label 23027 at (1) defined but not used [-Wunused-label]
     getlam.f:73:5:
    
     23023 continue
     1
     Warning: Label 23023 at (1) defined but not used [-Wunused-label]
     getlam.f:101:5:
    
     23020 ik=ik+1
     1
     Warning: Label 23020 at (1) defined but not used [-Wunused-label]
     getlam.f:92:10:
    
     lam=ik+(d1)
     1
     Warning: Possible change of value in conversion from REAL(8) to REAL(4) at (1) [-Wconversion]
     getlam.f:104:11:
    
     left=lammin
     1
     Warning: Possible change of value in conversion from REAL(4) to INTEGER(4) at (1) [-Wconversion]
     getlam.f:48:5:
    
     23018 continue
     1
     Warning: Label 23018 at (1) defined but not used [-Wunused-label]
     getlam.f:50:5:
    
     23015 i=i+1
     1
     Warning: Label 23015 at (1) defined but not used [-Wunused-label]
     clang -shared -L/usr/local/clang/lib64 -L/usr/local/lib64 -o princurvelegacy.so getlam.o sortdi.o -lgfortran -lm -lquadmath
     make[1]: Leaving directory '/tmp/RtmpSfEH7Q/devtoolsae9e63d1a6ae/dynverse-princurve-81b12ac/src'
     make[1]: Entering directory '/tmp/RtmpSfEH7Q/devtoolsae9e63d1a6ae/dynverse-princurve-81b12ac/src'
     make[1]: Leaving directory '/tmp/RtmpSfEH7Q/devtoolsae9e63d1a6ae/dynverse-princurve-81b12ac/src'
     installing to /tmp/RtmpOOBt2u/RLIBS_abdd28584276/princurvelegacy/libs
     ** R
     ** byte-compile and prepare package for lazy loading
     ** help
     *** installing help indices
     ** building package indices
     ** testing if installed package can be loaded
     * DONE (princurvelegacy)
     ── 1. Failure: project_to_cells is at least as fast as legacy get.lam (@test-leg
     smic$median[[2]] is not less than smic$median[[1]] * 2. Difference: 2.67
    
     ══ testthat results ═══════════════════════════════════════════════════════════
     OK: 536 SKIPPED: 0 FAILED: 1
     1. Failure: project_to_cells is at least as fast as legacy get.lam (@test-legacy_princurve.R#69)
    
     Error: testthat unit tests failed
     Execution halted
Flavor: r-devel-linux-x86_64-fedora-clang

Version: 2.1.0
Check: tests
Result: ERROR
     Running ‘testthat.R’ [73s/112s]
    Running the tests in ‘tests/testthat.R’ failed.
    Complete output:
     > library(testthat)
     >
     > Sys.setenv("R_TESTS" = "")
     >
     > test_check("princurve")
     Loading required package: princurve
     * installing *source* package ‘princurvelegacy’ ...
     ** libs
     f95 -PIC -O -libmil -xtarget=native -nofstore -c getlam.f -o getlam.o
     f95 -PIC -O -libmil -xtarget=native -nofstore -c sortdi.f -o sortdi.o
     cc -xc99 -G -L/usr/local/lib -o princurvelegacy.so getlam.o sortdi.o -L/opt/developerstudio12.5/lib/compilers -R/opt/developerstudio12.5/lib -lfsu -lsunquad -lsunmath -lmtsk -lm
     installing to /tmp/RtmpN8aGuQ/RLIBS_54a426a96a05/princurvelegacy/libs
     ** R
     ** byte-compile and prepare package for lazy loading
     ** help
     *** installing help indices
     ** building package indices
     ** testing if installed package can be loaded
     * DONE (princurvelegacy)
     ── 1. Failure: project_to_cells is at least as fast as legacy get.lam (@test-leg
     smic$median[[2]] is not less than smic$median[[1]] * 2. Difference: 2.97
    
     ══ testthat results ═══════════════════════════════════════════════════════════
     OK: 536 SKIPPED: 0 FAILED: 1
     1. Failure: project_to_cells is at least as fast as legacy get.lam (@test-legacy_princurve.R#69)
    
     Error: testthat unit tests failed
     Execution halted
Flavor: r-patched-solaris-x86

Version: 2.1.0
Check: tests
Result: ERROR
     Running ‘testthat.R’ [47s/50s]
    Running the tests in ‘tests/testthat.R’ failed.
    Last 13 lines of output:
     ** byte-compile and prepare package for lazy loading
     ** help
     *** installing help indices
     ** building package indices
     ** testing if installed package can be loaded
     * DONE (princurvelegacy)
     ── 1. Failure: project_to_cells is at least as fast as legacy get.lam (@test-leg
     smic$median[[2]] is not less than smic$median[[1]] * 2. Difference: 0.117
    
     ══ testthat results ═══════════════════════════════════════════════════════════
     OK: 536 SKIPPED: 0 FAILED: 1
     1. Failure: project_to_cells is at least as fast as legacy get.lam (@test-legacy_princurve.R#69)
    
     Error: testthat unit tests failed
     Execution halted
Flavor: r-release-osx-x86_64